Target
Neuropeptide FF receptor 2
Ligand
BDBM50037557
Substrate
Meas. Tech.
ChEMBL_2158117 (CHEMBL5042867)
Ki
1.1±n/a nM
Citation
 Quillet, RSchneider, SUtard, VDrieu la Rochelle, AElhabazi, KHenningsen, JBGizzi, PSchmitt, MKugler, VSimonneaux, VIlien, BSimonin, FBihel, F Identification of an  J Med Chem 64:7555-7564 (2021)  
Target
Name:
Neuropeptide FF receptor 2
Synonyms:
G-protein coupled receptor 74 NPFF2_MOUSE Npff2 | Npffr2
Type:
PROTEIN
Mol. Mass.:
47466.10
Organism:
Mus musculus
Description:
ChEMBL_119166
Residue:
417
  
Inhibitor
Name:
BDBM50037557
Synonyms:
2-{[1-(2-{2-[2-(2-Amino-3-phenyl-propionylamino)-4-methyl-pentanoylamino]-3-phenyl-propionylamino}-4-carbamoyl-butyryl)-pyrrolidine-2-carbonyl]-amino}-pentanedioic acid 5-amide 1-{[1-(1-carbamoyl-2-phenyl-ethylcarbamoyl)-4-guanidino-butyl]-amide} | CHEMBL429731
Type:
Small organic molecule
Emp. Form.:
C54H76N14O10
Mol. Mass.:
1081.269
SMILES:
CC(C)C[C@H](NC(=O)[C@@H](N)Cc1ccccc1)C(=O)N[C@@H](Cc1ccccc1)C(=O)N[C@@H](CCC(N)=O)C(=O)N1CCC[C@H]1C(=O)N[C@@H](CCC(N)=O)C(=O)N[C@@H](CCCNC(N)=N)C(=O)N[C@@H](Cc1ccccc1)C(N)=O
: