Target
Acetylcholinesterase
Ligand
BDBM10626
Substrate
Meas. Tech.
ChEMBL_2158896 (CHEMBL5043646)
IC50
27±n/a nM
Citation
 Liu, DZhang, HWang, YLiu, WYin, GWang, DLi, JShi, TWang, Z Design, synthesis, and biological evaluation of carbamate derivatives of N-salicyloyl tryptamine as multifunctional agents for the treatment of Alzheimer's disease. Eur J Med Chem 229:0 (2022)  
Target
Name:
Acetylcholinesterase
Synonyms:
ACES_HUMAN Acetylcholinesterase (AChE) | Acetylcholinesterase (human AChE)
Type:
Enzyme
Mol. Mass.:
67792.70
Organism:
Homo sapiens (Human)
Description:
P22303
Residue:
614
  
Inhibitor
Name:
BDBM10626
Synonyms:
(-)-(3aS)-3a-Methyl-2,3,3a,8a-Tetrahydrofuro[2,3-b]benzofuran-5-yl N-(p-Isopropylphenyl)carbamate Tetrahydrofurobenzofuran Carbamate 10a
Type:
Small organic molecule
Emp. Form.:
C21H23NO4
Mol. Mass.:
353.4116
SMILES:
CC(C)c1ccc(NC(=O)Oc2ccc3OC4OCC[C@@]4(C)c3c2)cc1
: