Target
Sodium/glucose cotransporter 2
Ligand
BDBM50153301
Substrate
Meas. Tech.
ChEMBL_308700 (CHEMBL834935)
Ki
10±n/a nM
Citation
 Dudash, JZhang, XZeck, REJohnson, SGCox, GGConway, BRRybczynski, PJDemarest, KT Glycosylated dihydrochalcones as potent and selective sodium glucose co-transporter 2 (SGLT2) inhibitors. Bioorg Med Chem Lett 14:5121-5 (2004)  
Target
Name:
Sodium/glucose cotransporter 2
Synonyms:
Na(+)/glucose cotransporter 2 SGLT2 Sodium-Dependent Glucose Cotransporter 2 (SGLT2) Solute carrier family 5 member 2
Type:
Protein
Mol. Mass.:
72902.00
Organism:
Homo sapiens (Human)
Description:
P31639
Residue:
672
  
Inhibitor
Name:
BDBM50153301
Synonyms:
3-(4-Ethoxy-phenyl)-1-[2-hydroxy-4-methyl-6-(3,4,5-trihydroxy-6-hydroxymethyl-tetrahydro-pyran-2-yloxy)-phenyl]-propan-1-one | CHEMBL187749
Type:
Small organic molecule
Emp. Form.:
C24H30O9
Mol. Mass.:
462.4896
SMILES:
CCOc1ccc(CCC(=O)c2c(O)cc(C)cc2O[C@@H]2O[C@H](CO)[C@@H](O)[C@H](O)[C@H]2O)cc1
: