Target
Sodium/glucose cotransporter 1
Ligand
BDBM50153305
Substrate
Meas. Tech.
ChEMBL_308699 (CHEMBL834934)
Ki
6500±n/a nM
Citation
 Dudash, JZhang, XZeck, REJohnson, SGCox, GGConway, BRRybczynski, PJDemarest, KT Glycosylated dihydrochalcones as potent and selective sodium glucose co-transporter 2 (SGLT2) inhibitors. Bioorg Med Chem Lett 14:5121-5 (2004)  
Target
Name:
Sodium/glucose cotransporter 1
Synonyms:
High affinity sodium-glucose cotransporter Na(+)/glucose cotransporter 1 SGLT1 Sodium-dependent glucose cotransporter 1 (SGLT1) Sodium/glucose cotransporter 1 (SGLT1) | Solute carrier family 5 member 1
Type:
Protein
Mol. Mass.:
73503.78
Organism:
Homo sapiens (Human)
Description:
P13866
Residue:
664
  
Inhibitor
Name:
BDBM50153305
Synonyms:
1-[4-Ethyl-2-hydroxy-6-(3,4,5-trihydroxy-6-hydroxymethyl-tetrahydro-pyran-2-yloxy)-phenyl]-3-naphthalen-2-yl-propan-1-one | CHEMBL184364
Type:
Small organic molecule
Emp. Form.:
C27H30O8
Mol. Mass.:
482.5223
SMILES:
CCc1cc(O)c(C(=O)CCc2ccc3ccccc3c2)c(O[C@@H]2O[C@H](CO)[C@@H](O)[C@H](O)[C@H]2O)c1
: