Target
Sodium/glucose cotransporter 2
Ligand
BDBM50153292
Substrate
Meas. Tech.
ChEMBL_308700 (CHEMBL834935)
Ki
70.0±n/a nM
Citation
 Dudash, JZhang, XZeck, REJohnson, SGCox, GGConway, BRRybczynski, PJDemarest, KT Glycosylated dihydrochalcones as potent and selective sodium glucose co-transporter 2 (SGLT2) inhibitors. Bioorg Med Chem Lett 14:5121-5 (2004)  
Target
Name:
Sodium/glucose cotransporter 2
Synonyms:
Na(+)/glucose cotransporter 2 SGLT2 Sodium-Dependent Glucose Cotransporter 2 (SGLT2) Solute carrier family 5 member 2
Type:
Protein
Mol. Mass.:
72902.00
Organism:
Homo sapiens (Human)
Description:
P31639
Residue:
672
  
Inhibitor
Name:
BDBM50153292
Synonyms:
1-[4-Fluoro-2-hydroxy-6-(3,4,5-trihydroxy-6-hydroxymethyl-tetrahydro-pyran-2-yloxy)-phenyl]-3-naphthalen-2-yl-propan-1-one | CHEMBL183689
Type:
Small organic molecule
Emp. Form.:
C25H25FO8
Mol. Mass.:
472.4596
SMILES:
OC[C@H]1O[C@@H](Oc2cc(F)cc(O)c2C(=O)CCc2ccc3ccccc3c2)[C@H](O)[C@@H](O)[C@@H]1O
: