Target
Sodium/glucose cotransporter 1
Ligand
BDBM50153294
Substrate
Meas. Tech.
ChEMBL_308699 (CHEMBL834934)
Ki
8390.0±n/a nM
Citation
 Dudash, JZhang, XZeck, REJohnson, SGCox, GGConway, BRRybczynski, PJDemarest, KT Glycosylated dihydrochalcones as potent and selective sodium glucose co-transporter 2 (SGLT2) inhibitors. Bioorg Med Chem Lett 14:5121-5 (2004)  
Target
Name:
Sodium/glucose cotransporter 1
Synonyms:
High affinity sodium-glucose cotransporter Na(+)/glucose cotransporter 1 SGLT1 Sodium-dependent glucose cotransporter 1 (SGLT1) Sodium/glucose cotransporter 1 (SGLT1) | Solute carrier family 5 member 1
Type:
Protein
Mol. Mass.:
73503.78
Organism:
Homo sapiens (Human)
Description:
P13866
Residue:
664
  
Inhibitor
Name:
BDBM50153294
Synonyms:
3-(4-Ethoxy-phenyl)-1-[4-ethyl-2-hydroxy-6-(3,4,5-trihydroxy-6-hydroxymethyl-tetrahydro-pyran-2-yloxy)-phenyl]-propan-1-one | CHEMBL184183
Type:
Small organic molecule
Emp. Form.:
C25H32O9
Mol. Mass.:
476.5162
SMILES:
CCOc1ccc(CCC(=O)c2c(O)cc(CC)cc2O[C@@H]2O[C@H](CO)[C@@H](O)[C@H](O)[C@H]2O)cc1
: