Target
Sodium/glucose cotransporter 2
Ligand
BDBM50153313
Substrate
Meas. Tech.
ChEMBL_308700 (CHEMBL834935)
Ki
40±n/a nM
Citation
 Dudash, JZhang, XZeck, REJohnson, SGCox, GGConway, BRRybczynski, PJDemarest, KT Glycosylated dihydrochalcones as potent and selective sodium glucose co-transporter 2 (SGLT2) inhibitors. Bioorg Med Chem Lett 14:5121-5 (2004)  
Target
Name:
Sodium/glucose cotransporter 2
Synonyms:
Na(+)/glucose cotransporter 2 SGLT2 Sodium-Dependent Glucose Cotransporter 2 (SGLT2) Solute carrier family 5 member 2
Type:
Protein
Mol. Mass.:
72902.00
Organism:
Homo sapiens (Human)
Description:
P31639
Residue:
672
  
Inhibitor
Name:
BDBM50153313
Synonyms:
3-Cyclohexyl-1-[2-hydroxy-4-methyl-6-(3,4,5-trihydroxy-6-hydroxymethyl-tetrahydro-pyran-2-yloxy)-phenyl]-propan-1-one | CHEMBL188013
Type:
Small organic molecule
Emp. Form.:
C22H32O8
Mol. Mass.:
424.4847
SMILES:
Cc1cc(O)c(C(=O)CCC2CCCCC2)c(O[C@@H]2O[C@H](CO)[C@@H](O)[C@H](O)[C@H]2O)c1
: