Target
Prolyl endopeptidase FAP
Ligand
BDBM50153384
Substrate
Meas. Tech.
ChEMBL_305437 (CHEMBL830113)
IC50
21000±n/a nM
Citation
 Edmondson, SDMastracchio, ABeconi, MColwell, LFHabulihaz, BHe, HKumar, SLeiting, BLyons, KAMao, AMarsilio, FPatel, RAWu, JKZhu, LThornberry, NAWeber, AEParmee, ER Potent and selective proline derived dipeptidyl peptidase IV inhibitors. Bioorg Med Chem Lett 14:5151-5 (2004)  
Target
Name:
Prolyl endopeptidase FAP
Synonyms:
170 kDa melanoma membrane-bound gelatinase Fibroblast Activation Protein (FAP) Integral membrane serine protease Seprase
Type:
Enzyme
Mol. Mass.:
87712.48
Organism:
Homo sapiens (Human)
Description:
Q12884
Residue:
760
  
Inhibitor
Name:
BDBM50153384
Synonyms:
CHEMBL364102 | Trifluoro-acetate3-{(S)-2-[4-((R)-1-carboxy-2-methyl-propoxy)-benzylcarbamoyl]-pyrrolidin-1-yl}-1-(2,5-difluoro-benzyl)-3-oxo-propyl-ammonium;
Type:
Small organic molecule
Emp. Form.:
C27H34F2N3O5
Mol. Mass.:
518.5722
SMILES:
CC(C)[C@@H](Oc1ccc(CNC(=O)[C@@H]2CCCN2C(=O)CC([NH3+])Cc2cc(F)ccc2F)cc1)C(O)=O
: