Target
Prolyl endopeptidase FAP
Ligand
BDBM50153382
Substrate
Meas. Tech.
ChEMBL_305437 (CHEMBL830113)
IC50
48000±n/a nM
Citation
 Edmondson, SDMastracchio, ABeconi, MColwell, LFHabulihaz, BHe, HKumar, SLeiting, BLyons, KAMao, AMarsilio, FPatel, RAWu, JKZhu, LThornberry, NAWeber, AEParmee, ER Potent and selective proline derived dipeptidyl peptidase IV inhibitors. Bioorg Med Chem Lett 14:5151-5 (2004)  
Target
Name:
Prolyl endopeptidase FAP
Synonyms:
170 kDa melanoma membrane-bound gelatinase Fibroblast Activation Protein (FAP) Integral membrane serine protease Seprase
Type:
Enzyme
Mol. Mass.:
87712.48
Organism:
Homo sapiens (Human)
Description:
Q12884
Residue:
760
  
Inhibitor
Name:
BDBM50153382
Synonyms:
CHEMBL183289 | Trifluoro-acetate3-{(S)-2-[4-((R)-1-carboxy-2-methyl-propoxy)-benzylcarbamoyl]-pyrrolidin-1-yl}-3-oxo-1-pentafluorophenylmethyl-propyl-ammonium;
Type:
Small organic molecule
Emp. Form.:
C27H31F5N3O5
Mol. Mass.:
572.5436
SMILES:
CC(C)[C@@H](Oc1ccc(CNC(=O)[C@@H]2CCCN2C(=O)CC([NH3+])Cc2c(F)c(F)c(F)c(F)c2F)cc1)C(O)=O
: