Target
Potassium voltage-gated channel subfamily H member 2
Ligand
BDBM50153381
Substrate
Meas. Tech.
ChEMBL_304886 (CHEMBL829261)
IC50
9700.0±n/a nM
Citation
 Edmondson, SDMastracchio, ABeconi, MColwell, LFHabulihaz, BHe, HKumar, SLeiting, BLyons, KAMao, AMarsilio, FPatel, RAWu, JKZhu, LThornberry, NAWeber, AEParmee, ER Potent and selective proline derived dipeptidyl peptidase IV inhibitors. Bioorg Med Chem Lett 14:5151-5 (2004)  
Target
Name:
Potassium voltage-gated channel subfamily H member 2
Synonyms:
1,3-beta-glucan synthase component GLS2 ERG Eag-related protein 1 Ether-a-go-go-related gene (HERG) Ether-a-go-go-related gene potassium channel 1 Ether-a-go-go-related gene potassium channel 1 (hERG1) Ether-a-go-go-related protein 1 H-ERG KCNH2 Potassium voltage-gated channel subfamily H member 2 (hERG) Voltage-gated potassium channel subunit Kv11.1 hERG Potassium Channel 1 | putative potassium channel subunit
Type:
Multi-pass membrane protein
Mol. Mass.:
126672.65
Organism:
Homo sapiens (Human)
Description:
Q12809
Residue:
1159
  
Inhibitor
Name:
BDBM50153381
Synonyms:
CHEMBL186482 | Trifluoro-acetate1-(2-fluoro-benzyl)-3-[(R)-4-(4-methoxycarbonylmethyl-benzylcarbamoyl)-thiazolidin-3-yl]-3-oxo-propyl-ammonium;
Type:
Small organic molecule
Emp. Form.:
C24H29FN3O4S
Mol. Mass.:
474.568
SMILES:
COC(=O)Cc1ccc(CNC(=O)[C@@H]2CSCN2C(=O)CC([NH3+])Cc2ccccc2F)cc1
: