Target
Dipeptidyl peptidase 8
Ligand
BDBM50153389
Substrate
Meas. Tech.
ChEMBL_304819 (CHEMBL827908)
IC50
>50000±n/a nM
Citation
 Edmondson, SDMastracchio, ABeconi, MColwell, LFHabulihaz, BHe, HKumar, SLeiting, BLyons, KAMao, AMarsilio, FPatel, RAWu, JKZhu, LThornberry, NAWeber, AEParmee, ER Potent and selective proline derived dipeptidyl peptidase IV inhibitors. Bioorg Med Chem Lett 14:5151-5 (2004)  
Target
Name:
Dipeptidyl peptidase 8
Synonyms:
DPP8 DPRP-1 Dipeptidyl peptidase 8 (DPP-8) Dipeptidyl peptidase 8/9 Dipeptidyl peptidase VIII Prolyl dipeptidase DPP8
Type:
Enzyme
Mol. Mass.:
103342.62
Organism:
Homo sapiens (Human)
Description:
Q6V1X1
Residue:
898
  
Inhibitor
Name:
BDBM50153389
Synonyms:
CHEMBL183060 | Trifluoro-acetate3-[(R)-4-(4-carboxymethyl-benzylcarbamoyl)-thiazolidin-3-yl]-1-(2-fluoro-benzyl)-3-oxo-propyl-ammonium;
Type:
Small organic molecule
Emp. Form.:
C23H27FN3O4S
Mol. Mass.:
460.541
SMILES:
[NH3+]C(CC(=O)N1CSC[C@H]1C(=O)NCc1ccc(CC(O)=O)cc1)Cc1ccccc1F
: