Target
Potassium voltage-gated channel subfamily H member 2
Ligand
BDBM50153386
Substrate
Meas. Tech.
ChEMBL_304886 (CHEMBL829261)
IC50
870.0±n/a nM
Citation
 Edmondson, SDMastracchio, ABeconi, MColwell, LFHabulihaz, BHe, HKumar, SLeiting, BLyons, KAMao, AMarsilio, FPatel, RAWu, JKZhu, LThornberry, NAWeber, AEParmee, ER Potent and selective proline derived dipeptidyl peptidase IV inhibitors. Bioorg Med Chem Lett 14:5151-5 (2004)  
Target
Name:
Potassium voltage-gated channel subfamily H member 2
Synonyms:
1,3-beta-glucan synthase component GLS2 ERG Eag-related protein 1 Ether-a-go-go-related gene (HERG) Ether-a-go-go-related gene potassium channel 1 Ether-a-go-go-related gene potassium channel 1 (hERG1) Ether-a-go-go-related protein 1 H-ERG KCNH2 Potassium voltage-gated channel subfamily H member 2 (hERG) Voltage-gated potassium channel subunit Kv11.1 hERG Potassium Channel 1 | putative potassium channel subunit
Type:
Multi-pass membrane protein
Mol. Mass.:
126672.65
Organism:
Homo sapiens (Human)
Description:
Q12809
Residue:
1159
  
Inhibitor
Name:
BDBM50153386
Synonyms:
CHEMBL435882 | Trifluoro-acetate1-(2-fluoro-benzyl)-3-oxo-3-[(S)-2-(4-trifluoromethyl-benzylcarbamoyl)-pyrrolidin-1-yl]-propyl-ammonium;
Type:
Small organic molecule
Emp. Form.:
C23H26F4N3O2
Mol. Mass.:
452.4645
SMILES:
[NH3+]C(CC(=O)N1CCC[C@H]1C(=O)NCc1ccc(cc1)C(F)(F)F)Cc1ccccc1F
: