Target
Dipeptidyl peptidase 4
Ligand
BDBM50153393
Substrate
Meas. Tech.
ChEMBL_305312 (CHEMBL831703)
IC50
295.0±n/a nM
Citation
 Edmondson, SDMastracchio, ABeconi, MColwell, LFHabulihaz, BHe, HKumar, SLeiting, BLyons, KAMao, AMarsilio, FPatel, RAWu, JKZhu, LThornberry, NAWeber, AEParmee, ER Potent and selective proline derived dipeptidyl peptidase IV inhibitors. Bioorg Med Chem Lett 14:5151-5 (2004)  
Target
Name:
Dipeptidyl peptidase 4
Synonyms:
ADABP Adenosine deaminase complexing protein 2 CD_antigen=CD26 DPP4 DPPIV Dipeptidyl peptidase 4 (DPP IV) Dipeptidyl peptidase 4 (DPP4) Dipeptidyl peptidase 4 membrane form Dipeptidyl peptidase IV Dipeptidyl peptidase IV (DDP-IV) Dipeptidyl peptidase IV membrane form Dipeptidyl peptidase-IV (DPP-4) T-cell activation antigen CD26 | TP103
Type:
Enzyme
Mol. Mass.:
88271.01
Organism:
Homo sapiens (Human)
Description:
P27487
Residue:
766
  
Inhibitor
Name:
BDBM50153393
Synonyms:
CHEMBL365280 | Trifluoro-acetate3-{(S)-2-[4-((R)-1-carboxy-2-methyl-propoxy)-benzylcarbamoyl]-pyrrolidin-1-yl}-3-oxo-1-(3-trifluoromethoxy-benzyl)-propyl-ammonium;
Type:
Small organic molecule
Emp. Form.:
C28H35F3N3O6
Mol. Mass.:
566.5887
SMILES:
CC(C)[C@@H](Oc1ccc(CNC(=O)[C@@H]2CCCN2C(=O)CC([NH3+])Cc2cccc(OC(F)(F)F)c2)cc1)C(O)=O
: