Target
Dipeptidyl peptidase 4
Ligand
BDBM50153394
Substrate
Meas. Tech.
ChEMBL_305312 (CHEMBL831703)
IC50
170±n/a nM
Citation
 Edmondson, SDMastracchio, ABeconi, MColwell, LFHabulihaz, BHe, HKumar, SLeiting, BLyons, KAMao, AMarsilio, FPatel, RAWu, JKZhu, LThornberry, NAWeber, AEParmee, ER Potent and selective proline derived dipeptidyl peptidase IV inhibitors. Bioorg Med Chem Lett 14:5151-5 (2004)  
Target
Name:
Dipeptidyl peptidase 4
Synonyms:
ADABP Adenosine deaminase complexing protein 2 CD_antigen=CD26 DPP4 DPPIV Dipeptidyl peptidase 4 (DPP IV) Dipeptidyl peptidase 4 (DPP4) Dipeptidyl peptidase 4 membrane form Dipeptidyl peptidase IV Dipeptidyl peptidase IV (DDP-IV) Dipeptidyl peptidase IV membrane form Dipeptidyl peptidase-IV (DPP-4) T-cell activation antigen CD26 | TP103
Type:
Enzyme
Mol. Mass.:
88271.01
Organism:
Homo sapiens (Human)
Description:
P27487
Residue:
766
  
Inhibitor
Name:
BDBM50153394
Synonyms:
CHEMBL185244 | Trifluoro-acetate1-(2-fluoro-benzyl)-3-[(S)-2-(4-methoxycarbonylmethyl-benzylcarbamoyl)-pyrrolidin-1-yl]-3-oxo-propyl-ammonium;
Type:
Small organic molecule
Emp. Form.:
C25H31FN3O4
Mol. Mass.:
456.5292
SMILES:
COC(=O)Cc1ccc(CNC(=O)[C@@H]2CCCN2C(=O)CC([NH3+])Cc2ccccc2F)cc1
: