Target
Dipeptidyl peptidase 4
Ligand
BDBM50153408
Substrate
Meas. Tech.
ChEMBL_305312 (CHEMBL831703)
IC50
118±n/a nM
Citation
 Edmondson, SDMastracchio, ABeconi, MColwell, LFHabulihaz, BHe, HKumar, SLeiting, BLyons, KAMao, AMarsilio, FPatel, RAWu, JKZhu, LThornberry, NAWeber, AEParmee, ER Potent and selective proline derived dipeptidyl peptidase IV inhibitors. Bioorg Med Chem Lett 14:5151-5 (2004)  
Target
Name:
Dipeptidyl peptidase 4
Synonyms:
ADABP Adenosine deaminase complexing protein 2 CD_antigen=CD26 DPP4 DPPIV Dipeptidyl peptidase 4 (DPP IV) Dipeptidyl peptidase 4 (DPP4) Dipeptidyl peptidase 4 membrane form Dipeptidyl peptidase IV Dipeptidyl peptidase IV (DDP-IV) Dipeptidyl peptidase IV membrane form Dipeptidyl peptidase-IV (DPP-4) T-cell activation antigen CD26 | TP103
Type:
Enzyme
Mol. Mass.:
88271.01
Organism:
Homo sapiens (Human)
Description:
P27487
Residue:
766
  
Inhibitor
Name:
BDBM50153408
Synonyms:
CHEMBL186787 | Trifluoro-acetate3-[(S)-2-(4-carboxymethoxy-benzylcarbamoyl)-pyrrolidin-1-yl]-1-(2-fluoro-benzyl)-3-oxo-propyl-ammonium;
Type:
Small organic molecule
Emp. Form.:
C24H29FN3O5
Mol. Mass.:
458.502
SMILES:
[NH3+]C(CC(=O)N1CCC[C@H]1C(=O)NCc1ccc(OCC(O)=O)cc1)Cc1ccccc1F
: