Target
Dipeptidyl peptidase 8
Ligand
BDBM50153404
Substrate
Meas. Tech.
ChEMBL_304819 (CHEMBL827908)
IC50
4100±n/a nM
Citation
 Edmondson, SDMastracchio, ABeconi, MColwell, LFHabulihaz, BHe, HKumar, SLeiting, BLyons, KAMao, AMarsilio, FPatel, RAWu, JKZhu, LThornberry, NAWeber, AEParmee, ER Potent and selective proline derived dipeptidyl peptidase IV inhibitors. Bioorg Med Chem Lett 14:5151-5 (2004)  
Target
Name:
Dipeptidyl peptidase 8
Synonyms:
DPP8 DPRP-1 Dipeptidyl peptidase 8 (DPP-8) Dipeptidyl peptidase 8/9 Dipeptidyl peptidase VIII Prolyl dipeptidase DPP8
Type:
Enzyme
Mol. Mass.:
103342.62
Organism:
Homo sapiens (Human)
Description:
Q6V1X1
Residue:
898
  
Inhibitor
Name:
BDBM50153404
Synonyms:
CHEMBL183418 | Trifluoro-acetate2-{(S)-2-[4-((R)-1-carboxy-2-methyl-propoxy)-benzylcarbamoyl]-pyrrolidin-1-yl}-1-cyclohexyl-2-oxo-ethyl-ammonium;
Type:
Small organic molecule
Emp. Form.:
C25H38N3O5
Mol. Mass.:
460.5858
SMILES:
CC(C)[C@@H](Oc1ccc(CNC(=O)[C@@H]2CCCN2C(=O)C([NH3+])C2CCCCC2)cc1)C(O)=O
: