Target
Dipeptidyl peptidase 4
Ligand
BDBM50153387
Substrate
Meas. Tech.
ChEMBL_305312 (CHEMBL831703)
IC50
75±n/a nM
Citation
 Edmondson, SDMastracchio, ABeconi, MColwell, LFHabulihaz, BHe, HKumar, SLeiting, BLyons, KAMao, AMarsilio, FPatel, RAWu, JKZhu, LThornberry, NAWeber, AEParmee, ER Potent and selective proline derived dipeptidyl peptidase IV inhibitors. Bioorg Med Chem Lett 14:5151-5 (2004)  
Target
Name:
Dipeptidyl peptidase 4
Synonyms:
ADABP Adenosine deaminase complexing protein 2 CD_antigen=CD26 DPP4 DPPIV Dipeptidyl peptidase 4 (DPP IV) Dipeptidyl peptidase 4 (DPP4) Dipeptidyl peptidase 4 membrane form Dipeptidyl peptidase IV Dipeptidyl peptidase IV (DDP-IV) Dipeptidyl peptidase IV membrane form Dipeptidyl peptidase-IV (DPP-4) T-cell activation antigen CD26 | TP103
Type:
Enzyme
Mol. Mass.:
88271.01
Organism:
Homo sapiens (Human)
Description:
P27487
Residue:
766
  
Inhibitor
Name:
BDBM50153387
Synonyms:
CHEMBL182223 | Trifluoro-acetate3-[(S)-2-(4-carboxy-benzylcarbamoyl)-pyrrolidin-1-yl]-1-(3,4-difluoro-benzyl)-3-oxo-propyl-ammonium;
Type:
Small organic molecule
Emp. Form.:
C23H26F2N3O4
Mol. Mass.:
446.4665
SMILES:
[NH3+]C(CC(=O)N1CCC[C@H]1C(=O)NCc1ccc(cc1)C(O)=O)Cc1ccc(F)c(F)c1
: