Target
Dipeptidyl peptidase 4
Ligand
BDBM50153411
Substrate
Meas. Tech.
ChEMBL_305312 (CHEMBL831703)
IC50
10±n/a nM
Citation
 Edmondson, SDMastracchio, ABeconi, MColwell, LFHabulihaz, BHe, HKumar, SLeiting, BLyons, KAMao, AMarsilio, FPatel, RAWu, JKZhu, LThornberry, NAWeber, AEParmee, ER Potent and selective proline derived dipeptidyl peptidase IV inhibitors. Bioorg Med Chem Lett 14:5151-5 (2004)  
Target
Name:
Dipeptidyl peptidase 4
Synonyms:
ADABP Adenosine deaminase complexing protein 2 CD_antigen=CD26 DPP4 DPPIV Dipeptidyl peptidase 4 (DPP IV) Dipeptidyl peptidase 4 (DPP4) Dipeptidyl peptidase 4 membrane form Dipeptidyl peptidase IV Dipeptidyl peptidase IV (DDP-IV) Dipeptidyl peptidase IV membrane form Dipeptidyl peptidase-IV (DPP-4) T-cell activation antigen CD26 | TP103
Type:
Enzyme
Mol. Mass.:
88271.01
Organism:
Homo sapiens (Human)
Description:
P27487
Residue:
766
  
Inhibitor
Name:
BDBM50153411
Synonyms:
CHEMBL365836 | Trifluoro-acetate3-{(S)-2-[4-(1-carboxy-butoxy)-benzylcarbamoyl]-pyrrolidin-1-yl}-1-(2-fluoro-benzyl)-3-oxo-propyl-ammonium;
Type:
Small organic molecule
Emp. Form.:
C27H35FN3O5
Mol. Mass.:
500.5818
SMILES:
CCCC(Oc1ccc(CNC(=O)[C@@H]2CCCN2C(=O)CC([NH3+])Cc2ccccc2F)cc1)C(O)=O
: