Target
Dipeptidyl peptidase 2
Ligand
BDBM50153386
Substrate
Meas. Tech.
ChEMBL_305046 (CHEMBL831684)
IC50
55000±n/a nM
Citation
 Edmondson, SDMastracchio, ABeconi, MColwell, LFHabulihaz, BHe, HKumar, SLeiting, BLyons, KAMao, AMarsilio, FPatel, RAWu, JKZhu, LThornberry, NAWeber, AEParmee, ER Potent and selective proline derived dipeptidyl peptidase IV inhibitors. Bioorg Med Chem Lett 14:5151-5 (2004)  
Target
Name:
Dipeptidyl peptidase 2
Synonyms:
DAP II DPP2_HUMAN Dipeptidyl aminopeptidase II Dipeptidyl peptidase 2 (DPP2) Dipeptidyl peptidase II (DPP II) Dipeptidyl peptidase II and dipeptidyl peptidase IV (DPP2 and DPP4) carboxytripeptidase dipeptidyl(amino)peptidase II | dipeptidylarylamidase
Type:
Protein
Mol. Mass.:
54339.29
Organism:
Homo sapiens (Human)
Description:
Q9UHL4
Residue:
492
  
Inhibitor
Name:
BDBM50153386
Synonyms:
CHEMBL435882 | Trifluoro-acetate1-(2-fluoro-benzyl)-3-oxo-3-[(S)-2-(4-trifluoromethyl-benzylcarbamoyl)-pyrrolidin-1-yl]-propyl-ammonium;
Type:
Small organic molecule
Emp. Form.:
C23H26F4N3O2
Mol. Mass.:
452.4645
SMILES:
[NH3+]C(CC(=O)N1CCC[C@H]1C(=O)NCc1ccc(cc1)C(F)(F)F)Cc1ccccc1F
: