Target
Adenosine receptor A1
Ligand
BDBM21190
Substrate
Meas. Tech.
ChEMBL_2160162 (CHEMBL5044912)
Ki
683±n/a nM
Citation
 Val, CRodríguez-García, CPrieto-Díaz, RCrespo, AAzuaje, JCarbajales, CMajellaro, MDíaz-Holguín, ABrea, JMLoza, MIGioé-Gallo, CContino, MStefanachi, AGarcía-Mera, XEstévez, JCGutiérrez-de-Terán, HSotelo, E Optimization of 2-Amino-4,6-diarylpyrimidine-5-carbonitriles as Potent and Selective A J Med Chem 65:2091-2106 (2022)  
Target
Name:
Adenosine receptor A1
Synonyms:
A1 adenosine receptor (hA1) AA1R_HUMAN ADORA1 Adenosine A1-receptor Adenosine receptor A1 (hA1) | Adenosine transporter (AdT)
Type:
G Protein-Coupled Receptor (GPCR)
Mol. Mass.:
36520.92
Organism:
Homo sapiens (Human)
Description:
P30542
Residue:
326
  
Inhibitor
Name:
BDBM21190
Synonyms:
4-(2-{[5-amino-2-(furan-2-yl)-[1,2,4]triazolo[1,5-a][1,3,5]triazin-7-yl]amino}ethyl)phenol ZM 241385 [3H]-ZM241385
Type:
Small organic molecule
Emp. Form.:
C16H15N7O2
Mol. Mass.:
337.336
SMILES:
Nc1nc(NCCc2ccc(O)cc2)nc2nc(nn12)-c1ccco1
: