Target
Ephrin type-A receptor 8
Ligand
BDBM50584720
Substrate
Meas. Tech.
ChEMBL_2160408 (CHEMBL5045158)
IC50
101±n/a nM
Citation
 Pan, SZhang, LLuo, XNan, JYang, WBin, HLi, YHuang, QWang, TPan, ZMu, BWang, FTian, CLiu, YLi, LYang, S Structural Optimization and Structure-Activity Relationship Studies of 6,6-Dimethyl-4-(phenylamino)-6 J Med Chem 65:2035-2058 (2022)  
Target
Name:
Ephrin type-A receptor 8
Synonyms:
EEK EPHA8_HUMAN Ephrin type-A receptor 8 KIAA1459
Type:
PROTEIN
Mol. Mass.:
111022.09
Organism:
Homo sapiens (Human)
Description:
ChEMBL_774600
Residue:
1005
  
Inhibitor
Name:
BDBM50584720
Synonyms:
CHEMBL5088153
Type:
Small organic molecule
Emp. Form.:
C29H31ClN8O3
Mol. Mass.:
575.061
SMILES:
Cc1cc(NC(=O)Nc2cc(nn2-c2ccc(Cl)cc2)C(C)(C)C)ccc1Nc1ncnc2NC(=O)C(C)(C)Oc12
: