Target
Ephrin type-A receptor 1
Ligand
BDBM50584948
Substrate
Meas. Tech.
ChEMBL_2160972 (CHEMBL5045722)
IC50
303±n/a nM
Citation
 Tong, LWang, PLi, XDong, XHu, XWang, CLiu, TLi, JZhou, Y Identification of 2-Aminopyrimidine Derivatives as FLT3 Kinase Inhibitors with High Selectivity over c-KIT. J Med Chem 65:3229-3248 (2022)  
Target
Name:
Ephrin type-A receptor 1
Synonyms:
EPH EPH tyrosine kinase 1 EPHA1_HUMAN EPHT1 Ephrin type-A receptor 1 Erythropoietin-producing hepatoma receptor hEpha1
Type:
Enzyme
Mol. Mass.:
108128.04
Organism:
Homo sapiens (Human)
Description:
P21709
Residue:
976
  
Inhibitor
Name:
BDBM50584948
Synonyms:
CHEMBL5092606
Type:
Small organic molecule
Emp. Form.:
C20H25F3N6O
Mol. Mass.:
422.4473
SMILES:
CN(C)C(=O)c1ccc(Nc2ncc(c(N[C@@H]3CC[C@H](N)CC3)n2)C(F)(F)F)cc1
: