Target
Ephrin type-A receptor 1
Ligand
BDBM50584949
Substrate
Meas. Tech.
ChEMBL_2160972 (CHEMBL5045722)
IC50
393±n/a nM
Citation
 Tong, LWang, PLi, XDong, XHu, XWang, CLiu, TLi, JZhou, Y Identification of 2-Aminopyrimidine Derivatives as FLT3 Kinase Inhibitors with High Selectivity over c-KIT. J Med Chem 65:3229-3248 (2022)  
Target
Name:
Ephrin type-A receptor 1
Synonyms:
EPH EPH tyrosine kinase 1 EPHA1_HUMAN EPHT1 Ephrin type-A receptor 1 Erythropoietin-producing hepatoma receptor hEpha1
Type:
Enzyme
Mol. Mass.:
108128.04
Organism:
Homo sapiens (Human)
Description:
P21709
Residue:
976
  
Inhibitor
Name:
BDBM50584949
Synonyms:
CHEMBL5089164
Type:
Small organic molecule
Emp. Form.:
C21H23F3N6O
Mol. Mass.:
432.4421
SMILES:
Cn1ccc2cc(Nc3ncc(c(N[C@@H]4CC[C@H](N)CC4)n3)C(F)(F)F)ccc2c1=O
: