Target
Delta-type opioid receptor
Ligand
BDBM50154040
Substrate
Meas. Tech.
ChEMBL_310403 (CHEMBL833181)
EC50
37±n/a nM
Citation
 Breslin, HJMiskowski, TARafferty, BMCoutinho, SVPalmer, JMWallace, NHSchneider, CRKimball, ESZhang, SPLi, JColburn, RWStone, DJMartinez, RPHe, W Rationale, design, and synthesis of novel phenyl imidazoles as opioid receptor agonists for gastrointestinal disorders. J Med Chem 47:5009-20 (2004)  
Target
Name:
Delta-type opioid receptor
Synonyms:
D-OR-1 Delta opioid receptor OPIATE Delta OPRD1 OPRK1 | opioid receptor, delta 1
Type:
G Protein-Coupled Receptor (GPCR)
Mol. Mass.:
40382.98
Organism:
Homo sapiens (Human)
Description:
Competition binding assays were carried out using membrane preparations from transfected HN9.10 cells that constitutively expressed the delta opioid receptor.
Residue:
372
  
Inhibitor
Name:
BDBM50154040
Synonyms:
2-Amino-1-[3-(1H-benzoimidazol-2-yl)-3,4-dihydro-1H-isoquinolin-2-yl]-3-(4-hydroxy-phenyl)-propan-1-one | CHEMBL362514
Type:
Small organic molecule
Emp. Form.:
C25H24N4O2
Mol. Mass.:
412.4837
SMILES:
N[C@@H](Cc1ccc(O)cc1)C(=O)N1Cc2ccccc2C[C@H]1c1nc2ccccc2[nH]1
: