Target
Sodium-dependent noradrenaline transporter
Ligand
BDBM50091097
Substrate
Meas. Tech.
ChEMBL_303519 (CHEMBL839633)
Ki
>1000±n/a nM
Citation
 Kung, HFNewman, SChoi, SROya, SHou, CZhuang, ZPActon, PDPlössl, KWinkler, JKung, MP 2-(2-(dimethylaminomethyl)phenoxy)-5-iodophenylamine: an improved serotonin transporter imaging agent. J Med Chem 47:5258-64 (2004)  
Target
Name:
Sodium-dependent noradrenaline transporter
Synonyms:
Monoamine transporter NET Noradrenaline Transporter (NET) Norepinephrine transporter protein (NET) SLC6A2 Sodium-dependent noradrenaline transporter (NET) | Solute carrier family 6 member 2
Type:
Multi-pass membrane protein
Mol. Mass.:
69337.72
Organism:
Homo sapiens (Human)
Description:
P23975
Residue:
617
  
Inhibitor
Name:
BDBM50091097
Synonyms:
3-Amino-4-(2-dimethylaminomethyl-phenylsulfanyl)-benzonitrile | CHEMBL106939
Type:
Small organic molecule
Emp. Form.:
C16H17N3S
Mol. Mass.:
283.391
SMILES:
CN(C)Cc1ccccc1Sc1ccc(cc1N)C#N
: