Target
Sodium-dependent dopamine transporter
Ligand
BDBM50154365
Substrate
Meas. Tech.
ChEMBL_303446 (CHEMBL839706)
Ki
309±n/a nM
Citation
 Kung, HFNewman, SChoi, SROya, SHou, CZhuang, ZPActon, PDPlössl, KWinkler, JKung, MP 2-(2-(dimethylaminomethyl)phenoxy)-5-iodophenylamine: an improved serotonin transporter imaging agent. J Med Chem 47:5258-64 (2004)  
Target
Name:
Sodium-dependent dopamine transporter
Synonyms:
DA transporter DAT1 Dopamine transporter protein (DAT) SC6A3_HUMAN Sodium-dependent dopamine transporter Solute carrier family 6 member 3
Type:
Multi-pass membrane protein
Mol. Mass.:
68497.11
Organism:
Homo sapiens (Human)
Description:
Q01959
Residue:
620
  
Inhibitor
Name:
BDBM50154365
Synonyms:
2-(2-((dimethylamino)methyl)phenoxy)-5-iodoaniline CHEMBL186962
Type:
Small organic molecule
Emp. Form.:
C15H17IN2O
Mol. Mass.:
368.2128
SMILES:
CN(C)Cc1ccccc1Oc1ccc(I)cc1N
: