Target
Sodium-dependent dopamine transporter
Ligand
BDBM50154367
Substrate
Meas. Tech.
ChEMBL_303446 (CHEMBL839706)
Ki
>1000±n/a nM
Citation
 Kung, HFNewman, SChoi, SROya, SHou, CZhuang, ZPActon, PDPlössl, KWinkler, JKung, MP 2-(2-(dimethylaminomethyl)phenoxy)-5-iodophenylamine: an improved serotonin transporter imaging agent. J Med Chem 47:5258-64 (2004)  
Target
Name:
Sodium-dependent dopamine transporter
Synonyms:
DA transporter DAT1 Dopamine transporter protein (DAT) SC6A3_HUMAN Sodium-dependent dopamine transporter Solute carrier family 6 member 3
Type:
Multi-pass membrane protein
Mol. Mass.:
68497.11
Organism:
Homo sapiens (Human)
Description:
Q01959
Residue:
620
  
Inhibitor
Name:
BDBM50154367
Synonyms:
2-(2-Dimethylaminomethyl-benzyl)-5-iodo-phenylamine | CHEMBL186056
Type:
Small organic molecule
Emp. Form.:
C16H19IN2
Mol. Mass.:
366.2399
SMILES:
CN(C)Cc1ccccc1Cc1ccc(I)cc1N
: