Target
Sodium-dependent dopamine transporter
Ligand
BDBM50073436
Substrate
Meas. Tech.
ChEMBL_303446 (CHEMBL839706)
Ki
>1000±n/a nM
Citation
 Kung, HFNewman, SChoi, SROya, SHou, CZhuang, ZPActon, PDPlössl, KWinkler, JKung, MP 2-(2-(dimethylaminomethyl)phenoxy)-5-iodophenylamine: an improved serotonin transporter imaging agent. J Med Chem 47:5258-64 (2004)  
Target
Name:
Sodium-dependent dopamine transporter
Synonyms:
DA transporter DAT1 Dopamine transporter protein (DAT) SC6A3_HUMAN Sodium-dependent dopamine transporter Solute carrier family 6 member 3
Type:
Multi-pass membrane protein
Mol. Mass.:
68497.11
Organism:
Homo sapiens (Human)
Description:
Q01959
Residue:
620
  
Inhibitor
Name:
BDBM50073436
Synonyms:
(2-(2-((dimethylamino)methyl)phenylthio)-5-iodophenyl)methanol CHEMBL2314219 | [2-(2-Dimethylaminomethyl-phenylsulfanyl)-5-iodo-phenyl]-methanol
Type:
Small organic molecule
Emp. Form.:
C16H18INOS
Mol. Mass.:
399.29
SMILES:
CN(C)Cc1ccccc1Sc1ccc(I)cc1CO
: