Target
Sodium-dependent serotonin transporter
Ligand
BDBM50091097
Substrate
Meas. Tech.
ChEMBL_303476 (CHEMBL877452)
Ki
1.1±n/a nM
Citation
 Kung, HFNewman, SChoi, SROya, SHou, CZhuang, ZPActon, PDPlössl, KWinkler, JKung, MP 2-(2-(dimethylaminomethyl)phenoxy)-5-iodophenylamine: an improved serotonin transporter imaging agent. J Med Chem 47:5258-64 (2004)  
Target
Name:
Sodium-dependent serotonin transporter
Synonyms:
5-HT Transporter 5HTT SC6A4_HUMAN SLC6A4 Serotonin transporter (5HTT) Sodium-dependent serotonin transporter (SERT) | Solute carrier family 6 member 4
Type:
Multi-pass membrane protein
Mol. Mass.:
70322.51
Organism:
Homo sapiens (Human)
Description:
P31645
Residue:
630
  
Inhibitor
Name:
BDBM50091097
Synonyms:
3-Amino-4-(2-dimethylaminomethyl-phenylsulfanyl)-benzonitrile | CHEMBL106939
Type:
Small organic molecule
Emp. Form.:
C16H17N3S
Mol. Mass.:
283.391
SMILES:
CN(C)Cc1ccccc1Sc1ccc(cc1N)C#N
: