Target
Sodium-dependent dopamine transporter
Ligand
BDBM50091097
Substrate
Meas. Tech.
ChEMBL_303446 (CHEMBL839706)
Ki
>1000±n/a nM
Citation
 Kung, HFNewman, SChoi, SROya, SHou, CZhuang, ZPActon, PDPlössl, KWinkler, JKung, MP 2-(2-(dimethylaminomethyl)phenoxy)-5-iodophenylamine: an improved serotonin transporter imaging agent. J Med Chem 47:5258-64 (2004)  
Target
Name:
Sodium-dependent dopamine transporter
Synonyms:
DA transporter DAT1 Dopamine transporter protein (DAT) SC6A3_HUMAN Sodium-dependent dopamine transporter Solute carrier family 6 member 3
Type:
Multi-pass membrane protein
Mol. Mass.:
68497.11
Organism:
Homo sapiens (Human)
Description:
Q01959
Residue:
620
  
Inhibitor
Name:
BDBM50091097
Synonyms:
3-Amino-4-(2-dimethylaminomethyl-phenylsulfanyl)-benzonitrile | CHEMBL106939
Type:
Small organic molecule
Emp. Form.:
C16H17N3S
Mol. Mass.:
283.391
SMILES:
CN(C)Cc1ccccc1Sc1ccc(cc1N)C#N
: