Target
Tyrosine-protein kinase
Ligand
BDBM50154588
Substrate
Meas. Tech.
ChEMBL_304473 (CHEMBL832689)
EC50
215000±n/a nM
Citation
 Inglis, SRStojkoski, CBranson, KMCawthray, JFFritz, DWiadrowski, EPyke, SMBooker, GW Identification and specificity studies of small-molecule ligands for SH3 protein domains. J Med Chem 47:5405-17 (2004)  
Target
Name:
Tyrosine-protein kinase
Synonyms:
Q8CFK4_MOUSE Tyrosine-protein kinase TEC
Type:
PROTEIN
Mol. Mass.:
71010.89
Organism:
Mus musculus
Description:
ChEMBL_304473
Residue:
608
  
Inhibitor
Name:
BDBM50154588
Synonyms:
5,6,7,8-Tetrahydro-quinolin-2-ylamine | CHEMBL188899
Type:
Small organic molecule
Emp. Form.:
C9H12N2
Mol. Mass.:
148.205
SMILES:
Nc1ccc2CCCCc2n1
: