Target
Tyrosine-protein kinase
Ligand
BDBM50154587
Substrate
Meas. Tech.
ChEMBL_304473 (CHEMBL832689)
EC50
34000±n/a nM
Citation
 Inglis, SRStojkoski, CBranson, KMCawthray, JFFritz, DWiadrowski, EPyke, SMBooker, GW Identification and specificity studies of small-molecule ligands for SH3 protein domains. J Med Chem 47:5405-17 (2004)  
Target
Name:
Tyrosine-protein kinase
Synonyms:
Q8CFK4_MOUSE Tyrosine-protein kinase TEC
Type:
PROTEIN
Mol. Mass.:
71010.89
Organism:
Mus musculus
Description:
ChEMBL_304473
Residue:
608
  
Inhibitor
Name:
BDBM50154587
Synonyms:
6-[1,3]Dioxolan-2-yl-quinolin-2-ylamine | CHEMBL366327
Type:
Small organic molecule
Emp. Form.:
C12H12N2O2
Mol. Mass.:
216.2359
SMILES:
Nc1ccc2cc(ccc2n1)C1OCCO1
: