Target
Tyrosine-protein kinase
Ligand
BDBM50154591
Substrate
Meas. Tech.
ChEMBL_304473 (CHEMBL832689)
EC50
58000±n/a nM
Citation
 Inglis, SRStojkoski, CBranson, KMCawthray, JFFritz, DWiadrowski, EPyke, SMBooker, GW Identification and specificity studies of small-molecule ligands for SH3 protein domains. J Med Chem 47:5405-17 (2004)  
Target
Name:
Tyrosine-protein kinase
Synonyms:
Q8CFK4_MOUSE Tyrosine-protein kinase TEC
Type:
PROTEIN
Mol. Mass.:
71010.89
Organism:
Mus musculus
Description:
ChEMBL_304473
Residue:
608
  
Inhibitor
Name:
BDBM50154591
Synonyms:
6-Bromo-quinolin-2-ylamine | CHEMBL189197
Type:
Small organic molecule
Emp. Form.:
C9H7BrN2
Mol. Mass.:
223.069
SMILES:
Nc1ccc2cc(Br)ccc2n1
: