Target
Metabotropic glutamate receptor 5
Ligand
BDBM50154977
Substrate
Meas. Tech.
ChEMBL_303754 (CHEMBL829797)
Ki
12±n/a nM
Citation
 Smith, NDPoon, SFHuang, DGreen, MKing, CTehrani, LRoppe, JRChung, JChapman, DPCramer, MCosford, ND Discovery of highly potent, selective, orally bioavailable, metabotropic glutamate subtype 5 (mGlu5) receptor antagonists devoid of cytochrome P450 1A2 inhibitory activity. Bioorg Med Chem Lett 14:5481-4 (2004)  
Target
Name:
Metabotropic glutamate receptor 5
Synonyms:
GRM5_RAT Grm5 Mglur5 metabotropic glutamate 5/1-C metabotropic glutamate 5a
Type:
Enzyme
Mol. Mass.:
131900.14
Organism:
Rattus norvegicus (Rat)
Description:
P31424
Residue:
1203
  
Inhibitor
Name:
BDBM50154977
Synonyms:
2-{2-[3-fluoro-5-(pyridin-3-yloxy)phenyl]-2H-tetrazol-5-yl}pyridine | CHEMBL186151
Type:
Small organic molecule
Emp. Form.:
C17H11FN6O
Mol. Mass.:
334.3072
SMILES:
Fc1cc(Oc2cccnc2)cc(c1)-n1nnc(n1)-c1ccccn1
: