Target
Mu-type opioid receptor
Ligand
BDBM50155111
Substrate
Meas. Tech.
ChEBML_302753
Ki
3.6±n/a nM
Citation
 Coats, SJSchulz, MJCarson, JRCodd, EEHlasta, DJPitis, PMStone, DJZhang, SPColburn, RWDax, SL Parallel methods for the preparation and SAR exploration of N-ethyl-4-[(8-alkyl-8-aza-bicyclo[3.2.1]oct-3-ylidene)-aryl-methyl]-benzamides, powerful mu and delta opioid agonists. Bioorg Med Chem Lett 14:5493-8 (2004)  
Target
Name:
Mu-type opioid receptor
Synonyms:
M-OR-1 Mor OPRM_MOUSE Oprm | Oprm1
Type:
Enzyme Catalytic Domain
Mol. Mass.:
44431.62
Organism:
MOUSE
Description:
OPIATE Mu OPRM1 MOUSE::P42866
Residue:
398
  
Inhibitor
Name:
BDBM50155111
Synonyms:
4-[(3-Acetylamino-phenyl)-(8-pyridin-2-ylmethyl-8-aza-bicyclo[3.2.1]oct-3-ylidene)-methyl]-N-ethyl-benzamide | CHEMBL185687
Type:
Small organic molecule
Emp. Form.:
C31H34N4O2
Mol. Mass.:
494.6273
SMILES:
[#6]-[#6]-[#7]-[#6](=O)-c1ccc(cc1)-[#6](=[#6]-1\[#6]-[#6]-2-[#6]-[#6]-[#6](-[#6]-1)-[#7]-2-[#6]-c1ccccn1)\c1cccc(-[#7]-[#6](-[#6])=O)c1
: