Target
Cyclin-dependent kinase 5 activator 1
Ligand
BDBM50585766
Substrate
Meas. Tech.
ChEMBL_2163810 (CHEMBL5048671)
IC50
0.200000±n/a nM
Citation
 Daniels, MHMalojcic, GClugston, SLWilliams, BCoeffet-Le Gal, MPan-Zhou, XRVenkatachalan, SHarmange, JCLedeboer, M Discovery and Optimization of Highly Selective Inhibitors of CDK5. J Med Chem 65:3575-3596 (2022)  
Target
Name:
Cyclin-dependent kinase 5 activator 1
Synonyms:
CDK5/p35 Cyclin-dependent kinase 5 regulatory subunit 1 | Cyclin-dependent kinase 5/CDK5 activator 1
Type:
Protein Complex
Mol. Mass.:
Description:
Components:
This complex has 2 components.
Component 1
Name:
Cyclin-dependent kinase 5
Synonyms:
CDK5 CDKN5 Cyclin-dependent kinase 5 (CDK5/ p25) Cyclin-dependent-like kinase 5 PSSALRE Tau protein kinase II catalytic subunit
Type:
Enzyme Subunit
Mol. Mass.:
33308.61
Organism:
Homo sapiens (Human)
Description:
Residue:
292
  
Component 2
Name:
Cyclin-dependent kinase 5 activator 1
Synonyms:
CD5R1_HUMAN CDK5R1 Cyclin-dependent kinase 5 (CDK5/p25) NCK5A p35
Type:
Enzyme Subunit
Mol. Mass.:
34077.43
Organism:
Homo sapiens (Human)
Description:
Q15078
Residue:
307
  
Inhibitor
Name:
BDBM50585766
Synonyms:
CHEMBL5080866
Type:
Small organic molecule
Emp. Form.:
C26H32FN5O2
Mol. Mass.:
465.563
SMILES:
CN1CCC(CC1)[C@@](C)(O)c1ccc2cnc(Nc3cc(ccc3F)N3CCOCC3)cc2n1
: