Target
Melatonin receptor type 1B
Ligand
BDBM50155716
Substrate
Meas. Tech.
ChEMBL_305097 (CHEMBL832401)
IC50
24±n/a nM
Citation
 Karageorge, GNBertenshaw, SIben, LXu, CSarbin, NGentile, ADubowchik, GM Tetrahydroisoquinoline derivatives as melatonin MT2 receptor antagonists. Bioorg Med Chem Lett 14:5881-4 (2004)  
Target
Name:
Melatonin receptor type 1B
Synonyms:
MTNR1B Mel-1B-R Melatonin 1B Melatonin receptor type 1B | Melatonin receptor type 2 (MT2)
Type:
Enzyme
Mol. Mass.:
40203.54
Organism:
Homo sapiens (Human)
Description:
P49286
Residue:
362
  
Inhibitor
Name:
BDBM50155716
Synonyms:
1-[6-Bromo-1-(2,2-diphenyl-ethyl)-7-methoxy-3,4-dihydro-1H-isoquinolin-2-yl]-ethanone | CHEMBL186941
Type:
Small organic molecule
Emp. Form.:
C26H26BrNO2
Mol. Mass.:
464.394
SMILES:
COc1cc2C(CC(c3ccccc3)c3ccccc3)N(CCc2cc1Br)C(C)=O
: