Target
Nitric oxide synthase, inducible
Ligand
BDBM50155785
Substrate
Meas. Tech.
ChEMBL_305247 (CHEMBL833505)
IC50
1100±n/a nM
Citation
 Shankaran, KDonnelly, KLShah, SKCaldwell, CGChen, PHagmann, WKMaccoss, MHumes, JLPacholok, SGKelly, TMGrant, SKWong, KK Synthesis of analogs of (1,4)-3- and 5-imino oxazepane, thiazepane, and diazepane as inhibitors of nitric oxide synthases. Bioorg Med Chem Lett 14:5907-11 (2004)  
Target
Name:
Nitric oxide synthase, inducible
Synonyms:
HEP-NOS Inducible NO synthase NOS type II NOS2A Nitric oxide synthase, inducible (iNOS) | iNOS
Type:
Homodimer
Mol. Mass.:
131141.95
Organism:
Homo sapiens (Human)
Description:
P35228
Residue:
1153
  
Inhibitor
Name:
BDBM50155785
Synonyms:
(5-Imino-[1,4]thiazepan-3-yl)-methanol | CHEMBL361722
Type:
Small organic molecule
Emp. Form.:
C6H12N2OS
Mol. Mass.:
160.237
SMILES:
NC1=NC(CO)CSCC1
: