Target
Nitric oxide synthase, brain
Ligand
BDBM50155788
Substrate
Meas. Tech.
ChEMBL_305218 (CHEMBL831638)
IC50
2800±n/a nM
Citation
 Shankaran, KDonnelly, KLShah, SKCaldwell, CGChen, PHagmann, WKMaccoss, MHumes, JLPacholok, SGKelly, TMGrant, SKWong, KK Synthesis of analogs of (1,4)-3- and 5-imino oxazepane, thiazepane, and diazepane as inhibitors of nitric oxide synthases. Bioorg Med Chem Lett 14:5907-11 (2004)  
Target
Name:
Nitric oxide synthase, brain
Synonyms:
Constitutive NOS NC-NOS NOS type I nNOS NOS1_HUMAN Neuronal nitric oxide synthase Nitric oxide synthase, neuronal (nNOS) bNOS | nNOS
Type:
Homodimer
Mol. Mass.:
160985.98
Organism:
Homo sapiens (Human)
Description:
P29475
Residue:
1434
  
Inhibitor
Name:
BDBM50155788
Synonyms:
3-Propyl-[1,4]thiazepan-(5E)-ylideneamine | CHEMBL186969
Type:
Small organic molecule
Emp. Form.:
C8H16N2S
Mol. Mass.:
172.291
SMILES:
CCCC1CSCCC(N)=N1
: