Target
Nitric oxide synthase, endothelial
Ligand
BDBM50104659
Substrate
Meas. Tech.
ChEMBL_305309 (CHEMBL831700)
IC50
25000±n/a nM
Citation
 Shankaran, KDonnelly, KLShah, SKCaldwell, CGChen, PHagmann, WKMaccoss, MHumes, JLPacholok, SGKelly, TMGrant, SKWong, KK Synthesis of analogs of (1,4)-3- and 5-imino oxazepane, thiazepane, and diazepane as inhibitors of nitric oxide synthases. Bioorg Med Chem Lett 14:5907-11 (2004)  
Target
Name:
Nitric oxide synthase, endothelial
Synonyms:
Constitutive NOS Endothelial NOS NOS type III NOS3_HUMAN Nitric oxide synthase (inducible and endothelial) Nitric-oxide synthase (endothelial and brain) eNOS
Type:
Enzyme Catalytic Domain
Mol. Mass.:
133297.84
Organism:
Homo sapiens (Human)
Description:
P29474
Residue:
1203
  
Inhibitor
Name:
BDBM50104659
Synonyms:
CHEMBL330548 [1,4]Oxazepan-(5Z)-ylideneamine
Type:
Small organic molecule
Emp. Form.:
C5H10N2O
Mol. Mass.:
114.1457
SMILES:
NC1=NCCOCC1
: