Target
Nitric oxide synthase, brain
Ligand
BDBM50155790
Substrate
Meas. Tech.
ChEMBL_305218 (CHEMBL831638)
IC50
160±n/a nM
Citation
 Shankaran, KDonnelly, KLShah, SKCaldwell, CGChen, PHagmann, WKMaccoss, MHumes, JLPacholok, SGKelly, TMGrant, SKWong, KK Synthesis of analogs of (1,4)-3- and 5-imino oxazepane, thiazepane, and diazepane as inhibitors of nitric oxide synthases. Bioorg Med Chem Lett 14:5907-11 (2004)  
Target
Name:
Nitric oxide synthase, brain
Synonyms:
Constitutive NOS NC-NOS NOS type I nNOS NOS1_HUMAN Neuronal nitric oxide synthase Nitric oxide synthase, neuronal (nNOS) bNOS | nNOS
Type:
Homodimer
Mol. Mass.:
160985.98
Organism:
Homo sapiens (Human)
Description:
P29475
Residue:
1434
  
Inhibitor
Name:
BDBM50155790
Synonyms:
CHEMBL362772 | [1,4]Oxazepan-(3E)-ylideneamine
Type:
Small organic molecule
Emp. Form.:
C5H10N2O
Mol. Mass.:
114.1457
SMILES:
NC1=NCCCOC1
: