Target
Phosphatidylinositol 3,4,5-trisphosphate 5-phosphatase 2
Ligand
BDBM50586357
Substrate
Meas. Tech.
ChEMBL_2168502 (CHEMBL5053561)
IC50
31±n/a nM
Citation
 Whitfield, HHemmings, AMMills, SJBaker, KWhite, GRushworth, SRiley, AMPotter, BVLBrearley, CA Allosteric Site on SHIP2 Identified Through Fluorescent Ligand Screening and Crystallography: A Potential New Target for Intervention. J Med Chem 64:3813-3826 (2021)  
Target
Name:
Phosphatidylinositol 3,4,5-trisphosphate 5-phosphatase 2
Synonyms:
INPPL-1 Inositol polyphosphate phosphatase-like protein 1 Protein 51C SHIP-2 SHIP2_HUMAN | Src homology-2 domain containing protein tyrosine phosphatase-2 (SHP2)
Type:
Enzyme
Mol. Mass.:
138596.65
Organism:
Homo sapiens (Human)
Description:
O15357
Residue:
1258
  
Inhibitor
Name:
BDBM50586357
Synonyms:
CHEMBL5080660
Type:
Small organic molecule
Emp. Form.:
C14H20O26P6
Mol. Mass.:
790.1356
SMILES:
OP(O)(=O)Oc1cc(OP(O)(O)=O)c(OP(O)(O)=O)cc1OCCOc1cc(OP(O)(O)=O)c(OP(O)(O)=O)cc1OP(O)(O)=O
: