Target
Phosphatidylinositol 3,4,5-trisphosphate 5-phosphatase 2
Ligand
BDBM50586355
Substrate
Meas. Tech.
ChEMBL_2168503 (CHEMBL5053562)
IC50
1000±n/a nM
Citation
 Whitfield, HHemmings, AMMills, SJBaker, KWhite, GRushworth, SRiley, AMPotter, BVLBrearley, CA Allosteric Site on SHIP2 Identified Through Fluorescent Ligand Screening and Crystallography: A Potential New Target for Intervention. J Med Chem 64:3813-3826 (2021)  
Target
Name:
Phosphatidylinositol 3,4,5-trisphosphate 5-phosphatase 2
Synonyms:
INPPL-1 Inositol polyphosphate phosphatase-like protein 1 Protein 51C SHIP-2 SHIP2_HUMAN | Src homology-2 domain containing protein tyrosine phosphatase-2 (SHP2)
Type:
Enzyme
Mol. Mass.:
138596.65
Organism:
Homo sapiens (Human)
Description:
O15357
Residue:
1258
  
Inhibitor
Name:
BDBM50586355
Synonyms:
CHEMBL5087243
Type:
Small organic molecule
Emp. Form.:
C12H16O24P6
Mol. Mass.:
730.0836
SMILES:
OP(O)(=O)Oc1cc(cc(OP(O)(O)=O)c1OP(O)(O)=O)-c1cc(OP(O)(O)=O)c(OP(O)(O)=O)c(OP(O)(O)=O)c1
: