Target
Phosphatidylinositol 3,4,5-trisphosphate 5-phosphatase 2
Ligand
BDBM50469035
Substrate
Meas. Tech.
ChEMBL_2168507 (CHEMBL5053566)
Ki
440±n/a nM
Citation
 Whitfield, HHemmings, AMMills, SJBaker, KWhite, GRushworth, SRiley, AMPotter, BVLBrearley, CA Allosteric Site on SHIP2 Identified Through Fluorescent Ligand Screening and Crystallography: A Potential New Target for Intervention. J Med Chem 64:3813-3826 (2021)  
Target
Name:
Phosphatidylinositol 3,4,5-trisphosphate 5-phosphatase 2
Synonyms:
INPPL-1 Inositol polyphosphate phosphatase-like protein 1 Protein 51C SHIP-2 SHIP2_HUMAN | Src homology-2 domain containing protein tyrosine phosphatase-2 (SHP2)
Type:
Enzyme
Mol. Mass.:
138596.65
Organism:
Homo sapiens (Human)
Description:
O15357
Residue:
1258
  
Inhibitor
Name:
BDBM50469035
Synonyms:
CHEMBL4282693
Type:
Small organic molecule
Emp. Form.:
C19H13Cl2F2NO2S
Mol. Mass.:
428.28
SMILES:
Fc1cccc(F)c1CNC(=O)c1sccc1OCc1ccc(Cl)cc1Cl
: