Target
Bcl-2-like protein 1
Ligand
BDBM50586597
Substrate
Meas. Tech.
ChEMBL_2169226 (CHEMBL5054285)
Kd
2.8±n/a nM
Citation
 Pal, PThummuri, DLv, DLiu, XZhang, PHu, WPoddar, SKHua, NKhan, SYuan, YZhang, XZhou, DZheng, G Discovery of a Novel BCL-X J Med Chem 64:14230-14246 (2021)  
Target
Name:
Bcl-2-like protein 1
Synonyms:
Anti-apoptotic Bcl-2 protein Apoptosis regulator Bcl-X BCL2-like 1 isoform 1 BCL2L1 Bcl-2-like protein 1 (Bcl-XL) Bcl-xL/Bcl-2-binding component 3 Bcl2-antagonist of cell death (BAD)
Type:
Mitochondrion membrane; Single-pass membrane protein
Mol. Mass.:
26039.60
Organism:
Homo sapiens (Human)
Description:
Residue:
233
  
Inhibitor
Name:
BDBM50586597
Synonyms:
CHEMBL5073297
Type:
Small organic molecule
Emp. Form.:
C80H102ClF3N10O11S4
Mol. Mass.:
1600.434
SMILES:
C[C@H](NC(=O)[C@@H]1C[C@@H](O)CN1C(=O)[C@@H](NC(=O)CCCCCCCCC(=O)NC[C@@]1(C)CCC(=C(CN2CCN(CC2)c2ccc(cc2)C(=O)NS(=O)(=O)c2ccc(N[C@H](CCN3CCOCC3)CSc3ccccc3)c(c2)S(=O)(=O)C(F)(F)F)C1)c1ccc(Cl)cc1)C(C)(C)C)c1ccc(cc1)-c1scnc1C
: