Target
Histamine H2 receptor
Ligand
BDBM50121205
Substrate
Meas. Tech.
ChEMBL_2169493 (CHEMBL5054552)
EC50
115±n/a nM
Citation
 Tropmann, KSeibel-Ehlert, ULittmann, TStrasser, A Shining light on the histamine H Bioorg Med Chem Lett 52:0 (2021)  
Target
Name:
Histamine H2 receptor
Synonyms:
Gastric receptor I HISTAMINE H2 HRH2_HUMAN Histamine H2-Gs alpha S
Type:
G Protein-Coupled Receptor (GPCR)
Mol. Mass.:
40115.31
Organism:
Homo sapiens (Human)
Description:
Residue:
359
  
Inhibitor
Name:
BDBM50121205
Synonyms:
CHEBI:18295 | Histamine
Type:
Small organic molecule
Emp. Form.:
C5H9N3
Mol. Mass.:
111.1451
SMILES:
NCCc1c[nH]cn1
: