Target
DNA-dependent protein kinase catalytic subunit
Ligand
BDBM50156497
Substrate
Meas. Tech.
ChEMBL_306016 (CHEMBL833531)
IC50
800±n/a nM
Citation
 Leahy, JJGolding, BTGriffin, RJHardcastle, IRRichardson, CRigoreau, LSmith, GC Identification of a highly potent and selective DNA-dependent protein kinase (DNA-PK) inhibitor (NU7441) by screening of chromenone libraries. Bioorg Med Chem Lett 14:6083-7 (2004)  
Target
Name:
DNA-dependent protein kinase catalytic subunit
Synonyms:
DNA-PK catalytic subunit DNA-dependent protein kinase (DNA-PK) DNA-dependent protein kinase catalytic subunit (DNA-PK) HYRC PRKDC | PRKDC_HUMAN
Type:
Protein
Mol. Mass.:
469114.78
Organism:
Homo sapiens (Human)
Description:
P78527
Residue:
4128
  
Inhibitor
Name:
BDBM50156497
Synonyms:
8-(5-Acetyl-thiophen-2-yl)-2-morpholin-4-yl-chromen-4-one CHEMBL187562
Type:
Small organic molecule
Emp. Form.:
C19H17NO4S
Mol. Mass.:
355.408
SMILES:
CC(=O)c1ccc(s1)-c1cccc2c1oc(cc2=O)N1CCOCC1
: