Target
Sodium channel protein type 4 subunit alpha
Ligand
BDBM70937
Substrate
Meas. Tech.
ChEMBL_2170566 (CHEMBL5055700)
IC50
3.4±n/a nM
Target
Name:
Sodium channel protein type 4 subunit alpha
Synonyms:
SCN4A SkM1 Sodium channel protein skeletal muscle subunit alpha Sodium channel protein type IV alpha subunit Voltage-gated sodium channel subunit alpha Nav1.4 | Voltage-gated sodium channel subunit alpha Nav1.4 (Nav1.4)
Type:
Protein
Mol. Mass.:
208010.01
Organism:
Homo sapiens (Human)
Description:
P35499
Residue:
1836
  
Inhibitor
Name:
BDBM70937
Synonyms:
US9546164, 100 | US9694002, 100
Type:
Small organic molecule
Emp. Form.:
C25H29Cl2FN2O4S
Mol. Mass.:
543.478
SMILES:
C[C@H](N1CCC(COc2cc(F)c(cc2C2CC2)C(=O)NS(C)(=O)=O)CC1)c1cc(Cl)cc(Cl)c1
: