Target
Prostaglandin E2 receptor EP4 subtype
Ligand
BDBM50156550
Substrate
Meas. Tech.
ChEMBL_429536 (CHEMBL918077)
Ki
900±n/a nM
Citation
 Elworthy, TRBrill, ERChiou, SSChu, FHarris, JRHendricks, RTHuang, JKim, WLach, LKMirzadegan, TYee, CWalker, KA Lactams as EP4 prostanoid receptor agonists. 3. Discovery of N-ethylbenzoic acid 2-pyrrolidinones as subtype selective agents. J Med Chem 47:6124-7 (2004)  
Target
Name:
Prostaglandin E2 receptor EP4 subtype
Synonyms:
PE2R4_HUMAN PGE2 receptor EP4 subtype PTGER4 Prostanoid EP4 receptor
Type:
Enzyme
Mol. Mass.:
53134.53
Organism:
Homo sapiens (Human)
Description:
P35408
Residue:
488
  
Inhibitor
Name:
BDBM50156550
Synonyms:
3-(3-((R)-2-((S,E)-3-hydroxyoct-1-enyl)-5-oxopyrrolidin-1-yl)propyl)benzoic acid | CHEMBL221946
Type:
Small organic molecule
Emp. Form.:
C22H31NO4
Mol. Mass.:
373.4858
SMILES:
CCCCC[C@H](O)\C=C\[C@H]1CCC(=O)N1CCCc1cccc(c1)C(O)=O
: