Target
Prostaglandin E2 receptor EP1 subtype
Ligand
BDBM50156551
Substrate
Meas. Tech.
ChEMBL_429533 (CHEMBL918074)
Ki
18000±n/a nM
Citation
 Elworthy, TRBrill, ERChiou, SSChu, FHarris, JRHendricks, RTHuang, JKim, WLach, LKMirzadegan, TYee, CWalker, KA Lactams as EP4 prostanoid receptor agonists. 3. Discovery of N-ethylbenzoic acid 2-pyrrolidinones as subtype selective agents. J Med Chem 47:6124-7 (2004)  
Target
Name:
Prostaglandin E2 receptor EP1 subtype
Synonyms:
PE2R1_HUMAN PTGER1 Prostaglandin E2 receptor EP1 subtype Prostanoid EP1 receptor
Type:
Enzyme
Mol. Mass.:
41834.57
Organism:
Homo sapiens (Human)
Description:
P34995
Residue:
402
  
Inhibitor
Name:
BDBM50156551
Synonyms:
4-{2-[(2S)-2-[(3R)-3-[3-(4-chloro-2-methylphenyl)phenyl]-3-hydroxypropyl]-5-oxopyrrolidin-1-yl]ethyl}benzoic acid | CHEMBL222677
Type:
Small organic molecule
Emp. Form.:
C29H30ClNO4
Mol. Mass.:
492.006
SMILES:
Cc1cc(Cl)ccc1-c1cccc(c1)[C@H](O)CC[C@H]1CCC(=O)N1CCc1ccc(cc1)C(O)=O
: